PHP Classes

File: bin/.phpunit/phpunit-7.5-0/tests/end-to-end/regression/GitHub/1351.phpt

Recommend this page to a friend!
  Classes of Paulo Henrique  >  symfony-dual-login  >  bin/.phpunit/phpunit-7.5-0/tests/end-to-end/regression/GitHub/1351.phpt  >  Download  
File: bin/.phpunit/phpunit-7.5-0/tests/end-to-end/regression/GitHub/1351.phpt
Role: Auxiliary data
Content type: text/plain
Description: Auxiliary data
Class: symfony-dual-login
API to get user details using OAuth authentication
Author: By
Last change:
Date: 1 year ago
Size: 1,077 bytes


Class file image Download
if (!extension_loaded('pdo') || !in_array('sqlite', PDO::getAvailableDrivers())) {
    print 'skip: PDO_SQLITE is required';
$_SERVER['argv'][1] = '--no-configuration';
$_SERVER['argv'][2] = '--process-isolation';
$_SERVER['argv'][3] = 'Issue1351Test';
$_SERVER['argv'][4] = __DIR__ . '/1351/Issue1351Test.php';

require __DIR__ . '/../../../bootstrap.php';
PHPUnit %s by Sebastian Bergmann and contributors.

F.E.E                                                               5 / 5 (100%)

Time: %s, Memory: %s

There were 2 errors:

1) Issue1351Test::testExceptionPre
RuntimeException: Expected rethrown exception.
Caused by
LogicException: Expected exception.

2) Issue1351Test::testPhpCoreLanguageException
PDOException: SQLSTATE[HY000]: General error: 1 no such table: php_wtf


There was 1 failure:

1) Issue1351Test::testFailurePre
Expected failure.
Tests: 5, Assertions: 5, Errors: 2, Failures: 1.
For more information send a message to info at phpclasses dot org.